Reaction Details
TargetApoptotic protease-activating factor 1
LigandBDBM83877
Substrate/Competitorn/a
Meas. Tech.Dose Response validation of Activators of Apaf-1 using a Fluorescent Interference Counterscreen assay
EC50>100000±0 nM
Citation PubChem, PC Dose Response validation of Activators of Apaf-1 using a Fluorescent Interference Counterscreen assay PubChem Bioassay(2011)[AID]
 
Apoptotic protease-activating factor 1
Name:Apoptotic protease-activating factor 1
Type:Enzyme Catalytic Domain
Mol. Mass.:141834.40
Organism:Homo sapiens (Human)
Description:O14727
Residue:1248
BDBM83877
NameBDBM83877
Synonyms:2-(4-methoxyphenyl)-5-methyl-6-(phenylmethyl)-1H-[1,2,4]triazolo[1,5-a]pyrimidin-7-one MLS000084170 cid_667143
TypeSmall organic molecule
Emp. Form.C20H18N4O2
Mol. Mass.346.3825
SMILESCOc1ccc(cc1)-c1nc2nc(C)c(Cc3ccccc3)c(=O)n2[nH]1