Reaction Details
TargetApoptotic protease-activating factor 1
LigandBDBM83998
Substrate/Competitorn/a
Meas. Tech.Dose Response validation of Activators of Apaf-1 using a Fluorescent Interference Counterscreen assay
EC50>100000±0 nM
Citation PubChem, PC Dose Response validation of Activators of Apaf-1 using a Fluorescent Interference Counterscreen assay PubChem Bioassay(2011)[AID]
 
Apoptotic protease-activating factor 1
Name:Apoptotic protease-activating factor 1
Type:Enzyme Catalytic Domain
Mol. Mass.:141834.40
Organism:Homo sapiens (Human)
Description:O14727
Residue:1248
BDBM83998
NameBDBM83998
Synonyms:4-(4-bromophenyl)-2-[1-(2-cyanoethyl)-3-indolyl]-4-oxobutanoic acid 4-(4-bromophenyl)-2-[1-(2-cyanoethyl)indol-3-yl]-4-oxidanylidene-butanoic acid MLS000120573 cid_5308016
TypeSmall organic molecule
Emp. Form.C21H17BrN2O3
Mol. Mass.425.275
SMILESOC(=O)C(CC(=O)c1ccc(Br)cc1)c1cn(CCC#N)c2ccccc12