Reaction Details
TargetApoptotic protease-activating factor 1
LigandBDBM83893
Substrate/Competitorn/a
Meas. Tech.Dose Response validation of Activators of Apaf-1 using a Fluorescent Interference Counterscreen assay
EC50>100000±0 nM
Citation PubChem, PC Dose Response validation of Activators of Apaf-1 using a Fluorescent Interference Counterscreen assay PubChem Bioassay(2011)[AID]
 
Apoptotic protease-activating factor 1
Name:Apoptotic protease-activating factor 1
Type:Enzyme Catalytic Domain
Mol. Mass.:141834.40
Organism:Homo sapiens (Human)
Description:O14727
Residue:1248
BDBM83893
NameBDBM83893
Synonyms:6-methoxy-7,8,9,10-tetrahydro-6H-[1,2,5]oxadiazolo[3,4-c]carbazole 6-methoxy-7,8,9,10-tetrahydrofurazano[3,4-c]carbazole SMR000137325 | cid_726977
TypeSmall organic molecule
Emp. Form.C13H13N3O2
Mol. Mass.243.2612
SMILESCOn1c2CCCCc2c2c1ccc1nonc21