Reaction Details
TargetApoptotic protease-activating factor 1
LigandBDBM61666
Substrate/Competitorn/a
Meas. Tech.Dose Response validation of Activators of Apaf-1 using a Fluorescent Interference Counterscreen assay
EC50>100000±0 nM
Citation PubChem, PC Dose Response validation of Activators of Apaf-1 using a Fluorescent Interference Counterscreen assay PubChem Bioassay(2011)[AID]
 
Apoptotic protease-activating factor 1
Name:Apoptotic protease-activating factor 1
Type:Enzyme Catalytic Domain
Mol. Mass.:141834.40
Organism:Homo sapiens (Human)
Description:O14727
Residue:1248
BDBM61666
NameBDBM61666
Synonyms:(5Z)-5-[(4-keto-5,7-dimethyl-chromen-3-yl)methylene]-2-thioxo-4-imidazolidinone (5Z)-5-[(5,7-dimethyl-4-oxo-1-benzopyran-3-yl)methylidene]-2-sulfanylidene-4-imidazolidinone 5-[(5,7-dimethyl-4-oxo-4H-chromen-3-yl)methylene]-2-thioxo-4-imidazolidinone SMR000115588 | cid_1818305
TypeSmall organic molecule
Emp. Form.C15H12N2O3S
Mol. Mass.300.332
SMILESCc1cc(C)c2c(c1)occ(\C=C1/NC(=S)NC1=O)c2=O