Reaction Details
TargetApoptotic protease-activating factor 1
LigandBDBM80137
Substrate/Competitorn/a
Meas. Tech.Dose Response validation of Activators of Apaf-1 using a Fluorescent Interference Counterscreen assay
EC50>100000±0 nM
Citation PubChem, PC Dose Response validation of Activators of Apaf-1 using a Fluorescent Interference Counterscreen assay PubChem Bioassay(2011)[AID]
 
Apoptotic protease-activating factor 1
Name:Apoptotic protease-activating factor 1
Type:Enzyme Catalytic Domain
Mol. Mass.:141834.40
Organism:Homo sapiens (Human)
Description:O14727
Residue:1248
BDBM80137
NameBDBM80137
Synonyms:3-(4-Fluoro-phenyl)-4,5-dihydro-isoxazole-5-carboxylic acid 3-(4-fluorophenyl)-4,5-dihydro-1,2-oxazole-5-carboxylic acid MLS000067264 cid_2981857
TypeSmall organic molecule
Emp. Form.C10H8FNO3
Mol. Mass.209.1738
SMILESOC(=O)C1CC(=NO1)c1ccc(F)cc1