Reaction Details
TargetApoptotic protease-activating factor 1
LigandBDBM83999
Substrate/Competitorn/a
Meas. Tech.Dose Response validation of Activators of Apaf-1 using a Fluorescent Interference Counterscreen assay
EC50>100000±0 nM
Citation PubChem, PC Dose Response validation of Activators of Apaf-1 using a Fluorescent Interference Counterscreen assay PubChem Bioassay(2011)[AID]
 
Apoptotic protease-activating factor 1
Name:Apoptotic protease-activating factor 1
Type:Enzyme Catalytic Domain
Mol. Mass.:141834.40
Organism:Homo sapiens (Human)
Description:O14727
Residue:1248
BDBM83999
NameBDBM83999
Synonyms:MLS000554836 Sodium; (2Z,4Z)-3-methyl-5-pyridin-3-yl-penta-2,4-dienoate sodium;(2Z,4Z)-3-methyl-5-(3-pyridinyl)penta-2,4-dienoate sodium;(2Z,4Z)-3-methyl-5-pyridin-3-yl-penta-2,4-dienoate | sodium;(2Z,4Z)-3-methyl-5-pyridin-3-ylpenta-2,4-dienoate
TypeSmall organic molecule
Emp. Form.C11H10NO2
Mol. Mass.188.2031
SMILESC\C(\C=C/c1cccnc1)=C\C([O-])=O