Reaction Details
TargetApoptotic protease-activating factor 1
LigandBDBM50974
Substrate/Competitorn/a
Meas. Tech.Dose Response validation of Activators of Apaf-1 using a Fluorescent Interference Counterscreen assay
EC50>100000±0 nM
Citation PubChem, PC Dose Response validation of Activators of Apaf-1 using a Fluorescent Interference Counterscreen assay PubChem Bioassay(2011)[AID]
 
Apoptotic protease-activating factor 1
Name:Apoptotic protease-activating factor 1
Type:Enzyme Catalytic Domain
Mol. Mass.:141834.40
Organism:Homo sapiens (Human)
Description:O14727
Residue:1248
BDBM50974
NameBDBM50974
Synonyms:1-(1-adamantyl)-3-[[(E)-(3-chloranyl-5-nitro-6-oxidanylidene-cyclohexa-2,4-dien-1-ylidene)methyl]amino]urea 1-(1-adamantyl)-3-[[(E)-(3-chloro-5-nitro-6-oxocyclohexa-2,4-dien-1-ylidene)methyl]amino]urea 5-chloro-2-hydroxy-3-nitrobenzaldehyde N-1-adamantylsemicarbazone SMR000193933 | cid_5903423
TypeSmall organic molecule
Emp. Form.C18H21ClN4O4
Mol. Mass.392.837
SMILES[H]C12CC3([H])CC([H])(C1)CC(C2)(C3)NC(=O)N[NH+]=C[c-]1cc(Cl)cc([N+]([O-])=O)c1=O