Reaction Details
TargetApoptotic protease-activating factor 1
LigandBDBM83911
Substrate/Competitorn/a
Meas. Tech.Dose Response validation of Activators of Apaf-1 using a Fluorescent Interference Counterscreen assay
EC50>100000±0 nM
Citation PubChem, PC Dose Response validation of Activators of Apaf-1 using a Fluorescent Interference Counterscreen assay PubChem Bioassay(2011)[AID]
 
Apoptotic protease-activating factor 1
Name:Apoptotic protease-activating factor 1
Type:Enzyme Catalytic Domain
Mol. Mass.:141834.40
Organism:Homo sapiens (Human)
Description:O14727
Residue:1248
BDBM83911
NameBDBM83911
Synonyms:MLS000590613 N-(9,10-diketo-2-anthryl)-3,4-dimethoxy-benzamide N-(9,10-dioxoanthracen-2-yl)-3,4-dimethoxybenzamide SMR000217561 | cid_5185720
TypeSmall organic molecule
Emp. Form.C23H17NO5
Mol. Mass.387.3848
SMILESCOc1ccc(cc1OC)C(=O)Nc1ccc2C(=O)c3ccccc3C(=O)c2c1