Reaction Details
TargetApoptotic protease-activating factor 1
LigandBDBM70892
Substrate/Competitorn/a
Meas. Tech.Dose Response validation of Activators of Apaf-1 using a Fluorescent Interference Counterscreen assay
EC50>100000±0 nM
Citation PubChem, PC Dose Response validation of Activators of Apaf-1 using a Fluorescent Interference Counterscreen assay PubChem Bioassay(2011)[AID]
 
Apoptotic protease-activating factor 1
Name:Apoptotic protease-activating factor 1
Type:Enzyme Catalytic Domain
Mol. Mass.:141834.40
Organism:Homo sapiens (Human)
Description:O14727
Residue:1248
BDBM70892
NameBDBM70892
Synonyms:3-(2-hydroxyanilino)-2-methyl-propionic acid 3-[(2-hydroxyphenyl)amino]-2-methyl-propanoic acid SMR000231838 | cid_3578348
TypeSmall organic molecule
Emp. Form.C10H13NO3
Mol. Mass.195.2151
SMILESCC(CNc1ccccc1O)C(O)=O