Reaction Details
TargetApoptotic protease-activating factor 1
LigandBDBM61293
Substrate/Competitorn/a
Meas. Tech.Dose Response validation of Activators of Apaf-1 using a Fluorescent Interference Counterscreen assay
EC50>100000±0 nM
Citation PubChem, PC Dose Response validation of Activators of Apaf-1 using a Fluorescent Interference Counterscreen assay PubChem Bioassay(2011)[AID]
 
Apoptotic protease-activating factor 1
Name:Apoptotic protease-activating factor 1
Type:Enzyme Catalytic Domain
Mol. Mass.:141834.40
Organism:Homo sapiens (Human)
Description:O14727
Residue:1248
BDBM61293
NameBDBM61293
Synonyms:4-(carbamoylamino)benzoic acid [2-(2-methoxy-4-nitroanilino)-2-oxoethyl] ester MLS000402248 [2-(2-methoxy-4-nitroanilino)-2-oxoethyl] 4-(carbamoylamino)benzoate cid_3372465
TypeSmall organic molecule
Emp. Form.C17H16N4O7
Mol. Mass.388.3315
SMILESCOc1cc(ccc1NC(=O)COC(=O)c1ccc(NC(N)=O)cc1)[N+]([O-])=O