Reaction Details
TargetApoptotic protease-activating factor 1
LigandBDBM84001
Substrate/Competitorn/a
Meas. Tech.Dose Response validation of Activators of Apaf-1 using a Fluorescent Interference Counterscreen assay
EC50>100000±0 nM
Citation PubChem, PC Dose Response validation of Activators of Apaf-1 using a Fluorescent Interference Counterscreen assay PubChem Bioassay(2011)[AID]
 
Apoptotic protease-activating factor 1
Name:Apoptotic protease-activating factor 1
Type:Enzyme Catalytic Domain
Mol. Mass.:141834.40
Organism:Homo sapiens (Human)
Description:O14727
Residue:1248
BDBM84001
NameBDBM84001
Synonyms:MLS000713260 cid_1102901
TypeSmall organic molecule
Emp. Form.C26H14N2O6
Mol. Mass.450.3992
SMILESOc1ccc(cc1)-n1c(=O)c2ccc3c4c(ccc(c24)c1=O)c(=O)n(-c1ccc(O)cc1)c3=O