Reaction Details
TargetApoptotic protease-activating factor 1
LigandBDBM84002
Substrate/Competitorn/a
Meas. Tech.Dose Response validation of Activators of Apaf-1 using a Fluorescent Interference Counterscreen assay
EC50>100000±0 nM
Citation PubChem, PC Dose Response validation of Activators of Apaf-1 using a Fluorescent Interference Counterscreen assay PubChem Bioassay(2011)[AID]
 
Apoptotic protease-activating factor 1
Name:Apoptotic protease-activating factor 1
Type:Enzyme Catalytic Domain
Mol. Mass.:141834.40
Organism:Homo sapiens (Human)
Description:O14727
Residue:1248
BDBM84002
NameBDBM84002
Synonyms:3-(3,5-dimethyl-1-pyrazolyl)-2-methylpropanoic acid 3-(3,5-dimethylpyrazol-1-yl)-2-methyl-propionic acid MLS000715150 cid_2758649
TypeSmall organic molecule
Emp. Form.C9H14N2O2
Mol. Mass.182.2197
SMILESCC(Cn1nc(C)cc1C)C(O)=O