Reaction Details
TargetApoptotic protease-activating factor 1
LigandBDBM84003
Substrate/Competitorn/a
Meas. Tech.Dose Response validation of Activators of Apaf-1 using a Fluorescent Interference Counterscreen assay
EC50>100000±0 nM
Citation PubChem, PC Dose Response validation of Activators of Apaf-1 using a Fluorescent Interference Counterscreen assay PubChem Bioassay(2011)[AID]
 
Apoptotic protease-activating factor 1
Name:Apoptotic protease-activating factor 1
Type:Enzyme Catalytic Domain
Mol. Mass.:141834.40
Organism:Homo sapiens (Human)
Description:O14727
Residue:1248
BDBM84003
NameBDBM84003
Synonyms:3-(1H-indol-3-yl)-2-methyl-propanoic acid 3-(1H-indol-3-yl)-2-methylpropanoic acid SMR000387067 | cid_2772042
TypeSmall organic molecule
Emp. Form.C12H13NO2
Mol. Mass.203.2371
SMILESCC(Cc1c[nH]c2ccccc12)C(O)=O