Reaction Details
TargetApoptotic protease-activating factor 1
LigandBDBM78821
Substrate/Competitorn/a
Meas. Tech.Dose Response validation of Activators of Apaf-1 using a Fluorescent Interference Counterscreen assay
EC50>100000±0 nM
Citation PubChem, PC Dose Response validation of Activators of Apaf-1 using a Fluorescent Interference Counterscreen assay PubChem Bioassay(2011)[AID]
 
Apoptotic protease-activating factor 1
Name:Apoptotic protease-activating factor 1
Type:Enzyme Catalytic Domain
Mol. Mass.:141834.40
Organism:Homo sapiens (Human)
Description:O14727
Residue:1248
BDBM78821
NameBDBM78821
Synonyms:MLS000770435 N-[2-(diethylamino)ethyl]-4-[[(E)-3-[3-ethoxy-4-(2-methylpropoxy)phenyl]-1-oxoprop-2-enyl]amino]benzamide SMR000343743 | cid_5965108
TypeSmall organic molecule
Emp. Form.C28H39N3O4
Mol. Mass.481.627
SMILESCCOc1cc(\C=C\C(=O)Nc2ccc(cc2)C(=O)NCCN(CC)CC)ccc1OCC(C)C