Reaction Details
TargetApoptotic protease-activating factor 1
LigandBDBM50603
Substrate/Competitorn/a
Meas. Tech.Dose Response validation of Activators of Apaf-1 using a Fluorescent Interference Counterscreen assay
EC50>100000±0 nM
Citation PubChem, PC Dose Response validation of Activators of Apaf-1 using a Fluorescent Interference Counterscreen assay PubChem Bioassay(2011)[AID]
 
Apoptotic protease-activating factor 1
Name:Apoptotic protease-activating factor 1
Type:Enzyme Catalytic Domain
Mol. Mass.:141834.40
Organism:Homo sapiens (Human)
Description:O14727
Residue:1248
BDBM50603
NameBDBM50603
Synonyms:(8S)-3-(3-methacrylamidophenyl)-7-(2-methyl-3,5-dinitro-benzoyl)-1-oxa-2,7-diazaspiro[4.4]non-2-ene-8-carboxamide (8S)-7-(2-methyl-3,5-dinitrobenzoyl)-3-[3-(2-methylprop-2-enoylamino)phenyl]-1-oxa-2,7-diazaspiro[4.4]non-2-ene-8-carboxamide MLS000561947 cid_16681840
TypeSmall organic molecule
Emp. Form.C25H24N6O8
Mol. Mass.536.4935
SMILESCC(=C)C(=O)Nc1cccc(c1)[C+]1CC2(CC(N(C2)C(=O)c2cc(cc(c2C)[N+]([O-])=O)[N+]([O-])=O)C(N)=O)O[N-]1