Reaction Details
TargetApoptotic protease-activating factor 1
LigandBDBM50604
Substrate/Competitorn/a
Meas. Tech.Dose Response validation of Activators of Apaf-1 using a Fluorescent Interference Counterscreen assay
EC50>100000±0 nM
Citation PubChem, PC Dose Response validation of Activators of Apaf-1 using a Fluorescent Interference Counterscreen assay PubChem Bioassay(2011)[AID]
 
Apoptotic protease-activating factor 1
Name:Apoptotic protease-activating factor 1
Type:Enzyme Catalytic Domain
Mol. Mass.:141834.40
Organism:Homo sapiens (Human)
Description:O14727
Residue:1248
BDBM50604
NameBDBM50604
Synonyms:(8S)-3-(3-methacrylamidophenyl)-7-[(E)-2-methylbut-2-enoyl]-1-oxa-2,7-diazaspiro[4.4]non-2-ene-8-carboxamide (8S)-7-[(E)-2-methylbut-2-enoyl]-3-[3-(2-methylprop-2-enoylamino)phenyl]-1-oxa-2,7-diazaspiro[4.4]non-2-ene-8-carboxamide SMR000390645 | cid_16681884
TypeSmall organic molecule
Emp. Form.C22H26N4O4
Mol. Mass.410.4662
SMILESC\C=C(/C)C(=O)N1CC2(C[C@H]1C(N)=O)CC(=NO2)c1cccc(NC(=O)C(C)=C)c1