Reaction Details
TargetApoptotic protease-activating factor 1
LigandBDBM80252
Substrate/Competitorn/a
Meas. Tech.Dose Response validation of Activators of Apaf-1 using a Fluorescent Interference Counterscreen assay
EC50>100000±0 nM
Citation PubChem, PC Dose Response validation of Activators of Apaf-1 using a Fluorescent Interference Counterscreen assay PubChem Bioassay(2011)[AID]
 
Apoptotic protease-activating factor 1
Name:Apoptotic protease-activating factor 1
Type:Enzyme Catalytic Domain
Mol. Mass.:141834.40
Organism:Homo sapiens (Human)
Description:O14727
Residue:1248
BDBM80252
NameBDBM80252
Synonyms:(8R)-3-[3-(2-methylprop-2-enoylamino)phenyl]-7-[2-(phenylcarbonyl)phenyl]carbonyl-1-oxa-2,7-diazaspiro[4.4]non-2-ene-8-carboxamide (8R)-7-(2-benzoylbenzoyl)-3-[3-(2-methylprop-2-enoylamino)phenyl]-1-oxa-2,7-diazaspiro[4.4]non-2-ene-8-carboxamide MLS000561966 cid_16681961
TypeSmall organic molecule
Emp. Form.C31H28N4O5
Mol. Mass.536.5778
SMILESCC(=C)C(=O)Nc1cccc(c1)C1=NOC2(C[C@@H](N(C2)C(=O)c2ccccc2C(=O)c2ccccc2)C(N)=O)C1