Reaction Details
TargetApoptotic protease-activating factor 1
LigandBDBM50674
Substrate/Competitorn/a
Meas. Tech.Dose Response validation of Activators of Apaf-1 using a Fluorescent Interference Counterscreen assay
EC50>100000±0 nM
Citation PubChem, PC Dose Response validation of Activators of Apaf-1 using a Fluorescent Interference Counterscreen assay PubChem Bioassay(2011)[AID]
 
Apoptotic protease-activating factor 1
Name:Apoptotic protease-activating factor 1
Type:Enzyme Catalytic Domain
Mol. Mass.:141834.40
Organism:Homo sapiens (Human)
Description:O14727
Residue:1248
BDBM50674
NameBDBM50674
Synonyms:4-[(5E)-5-[[5-(1,3-benzothiazol-2-yl)-2-furanyl]methylidene]-4-oxo-2-sulfanylidene-3-thiazolidinyl]butanoic acid 4-[(5E)-5-[[5-(1,3-benzothiazol-2-yl)furan-2-yl]methylidene]-4-oxidanylidene-2-sulfanylidene-1,3-thiazolidin-3-yl]butanoic acid CHEMBL442449 SMR000364586 | cid_2012945
TypeSmall organic molecule
Emp. Form.C19H14N2O4S3
Mol. Mass.430.52
SMILESOC(=O)CCCN1C(=S)S\C(=C\c2ccc(o2)-c2nc3ccccc3s2)C1=O