Reaction Details
TargetApoptotic protease-activating factor 1
LigandBDBM80289
Substrate/Competitorn/a
Meas. Tech.Dose Response validation of Activators of Apaf-1 using a Fluorescent Interference Counterscreen assay
EC50>100000±0 nM
Citation PubChem, PC Dose Response validation of Activators of Apaf-1 using a Fluorescent Interference Counterscreen assay PubChem Bioassay(2011)[AID]
 
Apoptotic protease-activating factor 1
Name:Apoptotic protease-activating factor 1
Type:Enzyme Catalytic Domain
Mol. Mass.:141834.40
Organism:Homo sapiens (Human)
Description:O14727
Residue:1248
BDBM80289
NameBDBM80289
Synonyms:(8S)-3-(3-methacrylamidophenyl)-7-[(E)-pent-2-enoyl]-1-oxa-2,7-diazaspiro[4.4]non-2-ene-8-carboxamide (8S)-3-[3-[(2-methyl-1-oxoprop-2-enyl)amino]phenyl]-7-[(E)-1-oxopent-2-enyl]-1-oxa-2,7-diazaspiro[4.4]non-2-ene-8-carboxamide SMR000390637 | cid_16745457
TypeSmall organic molecule
Emp. Form.C22H26N4O4
Mol. Mass.410.4662
SMILESCC\C=C\C(=O)N1CC2(C[C@H]1C(N)=O)CC(=NO2)c1cccc(NC(=O)C(C)=C)c1