Reaction Details
TargetApoptotic protease-activating factor 1
LigandBDBM50715
Substrate/Competitorn/a
Meas. Tech.Dose Response validation of Activators of Apaf-1 using a Fluorescent Interference Counterscreen assay
EC50>100000±0 nM
Citation PubChem, PC Dose Response validation of Activators of Apaf-1 using a Fluorescent Interference Counterscreen assay PubChem Bioassay(2011)[AID]
 
Apoptotic protease-activating factor 1
Name:Apoptotic protease-activating factor 1
Type:Enzyme Catalytic Domain
Mol. Mass.:141834.40
Organism:Homo sapiens (Human)
Description:O14727
Residue:1248
BDBM50715
NameBDBM50715
Synonyms:(8R)-3-[3-[(2-methyl-1-oxoprop-2-enyl)amino]phenyl]-7-[(E)-1-oxobut-2-enyl]-1-oxa-2,7-diazaspiro[4.4]non-2-ene-8-carboxamide (8R)-7-[(E)-but-2-enoyl]-3-[3-(2-methylprop-2-enoylamino)phenyl]-1-oxa-2,7-diazaspiro[4.4]non-2-ene-8-carboxamide SMR000390639 | cid_16745482
TypeSmall organic molecule
Emp. Form.C21H24N4O4
Mol. Mass.396.4397
SMILESC\C=C\C(=O)N1CC2(C[C@@H]1C(N)=O)CC(=NO2)c1cccc(NC(=O)C(C)=C)c1