Reaction Details
TargetApoptotic protease-activating factor 1
LigandBDBM50716
Substrate/Competitorn/a
Meas. Tech.Dose Response validation of Activators of Apaf-1 using a Fluorescent Interference Counterscreen assay
EC50>100000±0 nM
Citation PubChem, PC Dose Response validation of Activators of Apaf-1 using a Fluorescent Interference Counterscreen assay PubChem Bioassay(2011)[AID]
 
Apoptotic protease-activating factor 1
Name:Apoptotic protease-activating factor 1
Type:Enzyme Catalytic Domain
Mol. Mass.:141834.40
Organism:Homo sapiens (Human)
Description:O14727
Residue:1248
BDBM50716
NameBDBM50716
Synonyms:(8R)-3-[3-[(2-methyl-1-oxoprop-2-enyl)amino]phenyl]-7-(1-oxo-2,2-diphenylethyl)-1-oxa-2,7-diazaspiro[4.4]non-2-ene-8-carboxamide (8R)-7-(2,2-diphenylacetyl)-3-[3-(2-methylprop-2-enoylamino)phenyl]-1-oxa-2,7-diazaspiro[4.4]non-2-ene-8-carboxamide MLS000562003 cid_16745486
TypeSmall organic molecule
Emp. Form.C31H30N4O4
Mol. Mass.522.5943
SMILESCC(=C)C(=O)Nc1cccc(c1)C1=NOC2(C[C@@H](N(C2)C(=O)C(c2ccccc2)c2ccccc2)C(N)=O)C1