Reaction Details
TargetApoptotic protease-activating factor 1
LigandBDBM71274
Substrate/Competitorn/a
Meas. Tech.Dose Response validation of Activators of Apaf-1 using a Fluorescent Interference Counterscreen assay
EC50>100000±0 nM
Citation PubChem, PC Dose Response validation of Activators of Apaf-1 using a Fluorescent Interference Counterscreen assay PubChem Bioassay(2011)[AID]
 
Apoptotic protease-activating factor 1
Name:Apoptotic protease-activating factor 1
Type:Enzyme Catalytic Domain
Mol. Mass.:141834.40
Organism:Homo sapiens (Human)
Description:O14727
Residue:1248
BDBM71274
NameBDBM71274
Synonyms:6-(3-acetylphenyl)-3-anilino-2H-isoquinolin-1-one 6-(3-ethanoylphenyl)-3-phenylazanyl-2H-isoquinolin-1-one SMR000472416 | cid_16727383
TypeSmall organic molecule
Emp. Form.C23H18N2O2
Mol. Mass.354.4012
SMILESCC(=O)c1cccc(c1)-c1ccc2c(cc(Nc3ccccc3)[nH]c2=O)c1