Reaction Details
TargetApoptotic protease-activating factor 1
LigandBDBM83948
Substrate/Competitorn/a
Meas. Tech.Dose Response validation of Activators of Apaf-1 using a Fluorescent Interference Counterscreen assay
EC50>100000±0 nM
Citation PubChem, PC Dose Response validation of Activators of Apaf-1 using a Fluorescent Interference Counterscreen assay PubChem Bioassay(2011)[AID]
 
Apoptotic protease-activating factor 1
Name:Apoptotic protease-activating factor 1
Type:Enzyme Catalytic Domain
Mol. Mass.:141834.40
Organism:Homo sapiens (Human)
Description:O14727
Residue:1248
BDBM83948
NameBDBM83948
Synonyms:MLS001202922 N-(2,6-dimethylphenyl)-2-(3-formyl-1-indolyl)acetamide N-(2,6-dimethylphenyl)-2-(3-methanoylindol-1-yl)ethanamide cid_965799
TypeSmall organic molecule
Emp. Form.C19H18N2O2
Mol. Mass.306.3584
SMILESCc1cccc(C)c1NC(=O)Cn1cc(C=O)c2ccccc12