Reaction Details
TargetApoptotic protease-activating factor 1
LigandBDBM46244
Substrate/Competitorn/a
Meas. Tech.Dose Response validation of Activators of Apaf-1 using a Fluorescent Interference Counterscreen assay
EC50>100000±0 nM
Citation PubChem, PC Dose Response validation of Activators of Apaf-1 using a Fluorescent Interference Counterscreen assay PubChem Bioassay(2011)[AID]
 
Apoptotic protease-activating factor 1
Name:Apoptotic protease-activating factor 1
Type:Enzyme Catalytic Domain
Mol. Mass.:141834.40
Organism:Homo sapiens (Human)
Description:O14727
Residue:1248
BDBM46244
NameBDBM46244
Synonyms:3-[[(E)-3-[4-(4-chlorobenzyl)oxyphenyl]-2-cyano-acryloyl]amino]benzoic acid 3-[[(E)-3-[4-[(4-chlorophenyl)methoxy]phenyl]-2-cyano-prop-2-enoyl]amino]benzoic acid MLS-0334991.0001 | cid_1516220
TypeSmall organic molecule
Emp. Form.C24H17ClN2O4
Mol. Mass.432.856
SMILESOC(=O)c1cccc(NC(=O)C(=C\c2ccc(OCc3ccc(Cl)cc3)cc2)\C#N)c1