Reaction Details
TargetApoptotic protease-activating factor 1
LigandBDBM71433
Substrate/Competitorn/a
Meas. Tech.Dose Response validation of Activators of Apaf-1 using a Fluorescent Interference Counterscreen assay
EC50>100000±0 nM
Citation PubChem, PC Dose Response validation of Activators of Apaf-1 using a Fluorescent Interference Counterscreen assay PubChem Bioassay(2011)[AID]
 
Apoptotic protease-activating factor 1
Name:Apoptotic protease-activating factor 1
Type:Enzyme Catalytic Domain
Mol. Mass.:141834.40
Organism:Homo sapiens (Human)
Description:O14727
Residue:1248
BDBM71433
NameBDBM71433
Synonyms:(NE)-2,5-dimethyl-N-[4-oxidanylidene-3-(phenylsulfonylamino)naphthalen-1-ylidene]benzenesulfonamide (NE)-N-[3-(benzenesulfonamido)-4-oxo-1-naphthalenylidene]-2,5-dimethylbenzenesulfonamide MLS000948070 cid_24789788
TypeSmall organic molecule
Emp. Form.C24H20N2O5S2
Mol. Mass.480.556
SMILESCc1ccc(C)c(c1)S(=O)(=O)\N=C1/C=C(NS(=O)(=O)c2ccccc2)C(=O)c2ccccc12