Reaction Details
TargetApoptotic protease-activating factor 1
LigandBDBM84006
Substrate/Competitorn/a
Meas. Tech.Dose Response validation of Activators of Apaf-1 using a Fluorescent Interference Counterscreen assay
EC50>100000±0 nM
Citation PubChem, PC Dose Response validation of Activators of Apaf-1 using a Fluorescent Interference Counterscreen assay PubChem Bioassay(2011)[AID]
 
Apoptotic protease-activating factor 1
Name:Apoptotic protease-activating factor 1
Type:Enzyme Catalytic Domain
Mol. Mass.:141834.40
Organism:Homo sapiens (Human)
Description:O14727
Residue:1248
BDBM84006
NameBDBM84006
Synonyms:6-[3-[4-(3-chlorophenyl)-1-piperazinyl]-2-methyl-3-oxopropyl]sulfonyl-4H-1,4-benzothiazin-3-one 6-[3-[4-(3-chlorophenyl)piperazin-1-yl]-2-methyl-3-oxopropyl]sulfonyl-4H-1,4-benzothiazin-3-one MLS001116611 cid_20923271
TypeSmall organic molecule
Emp. Form.C22H24ClN3O4S2
Mol. Mass.494.027
SMILESCC(CS(=O)(=O)c1ccc2SCC(=O)Nc2c1)C(=O)N1CCN(CC1)c1cccc(Cl)c1