Reaction Details
TargetApoptotic protease-activating factor 1
LigandBDBM79509
Substrate/Competitorn/a
Meas. Tech.Dose Response validation of Activators of Apaf-1 using a Fluorescent Interference Counterscreen assay
EC50>100000±0 nM
Citation PubChem, PC Dose Response validation of Activators of Apaf-1 using a Fluorescent Interference Counterscreen assay PubChem Bioassay(2011)[AID]
 
Apoptotic protease-activating factor 1
Name:Apoptotic protease-activating factor 1
Type:Enzyme Catalytic Domain
Mol. Mass.:141834.40
Organism:Homo sapiens (Human)
Description:O14727
Residue:1248
BDBM79509
NameBDBM79509
Synonyms:3-(4-bromophenyl)sulfonyl-N-(2-methoxy-5-nitro-phenyl)propanamide 3-[(4-bromophenyl)sulfonyl]-N-(2-methoxy-5-nitrophenyl)propanamide MLS001202265 cid_4104619
TypeSmall organic molecule
Emp. Form.C16H15BrN2O6S
Mol. Mass.443.269
SMILESCOc1ccc(cc1NC(=O)CCS(=O)(=O)c1ccc(Br)cc1)[N+]([O-])=O