Reaction Details
TargetApoptotic protease-activating factor 1
LigandBDBM61754
Substrate/Competitorn/a
Meas. Tech.Dose Response validation of Activators of Apaf-1 using a Fluorescent Interference Counterscreen assay
EC50>100000±0 nM
Citation PubChem, PC Dose Response validation of Activators of Apaf-1 using a Fluorescent Interference Counterscreen assay PubChem Bioassay(2011)[AID]
 
Apoptotic protease-activating factor 1
Name:Apoptotic protease-activating factor 1
Type:Enzyme Catalytic Domain
Mol. Mass.:141834.40
Organism:Homo sapiens (Human)
Description:O14727
Residue:1248
BDBM61754
NameBDBM61754
Synonyms:3-(4-bromophenyl)sulfonyl-N-(2-furanylmethyl)propanamide 3-brosyl-N-(2-furfuryl)propionamide SMR000635582 | cid_4253422
TypeSmall organic molecule
Emp. Form.C14H14BrNO4S
Mol. Mass.372.234
SMILESBrc1ccc(cc1)S(=O)(=O)CCC(=O)NCc1ccco1