Reaction Details
TargetApoptotic protease-activating factor 1
LigandBDBM48039
Substrate/Competitorn/a
Meas. Tech.Dose Response validation of Activators of Apaf-1 using a Fluorescent Interference Counterscreen assay
EC50>100000±0 nM
Citation PubChem, PC Dose Response validation of Activators of Apaf-1 using a Fluorescent Interference Counterscreen assay PubChem Bioassay(2011)[AID]
 
Apoptotic protease-activating factor 1
Name:Apoptotic protease-activating factor 1
Type:Enzyme Catalytic Domain
Mol. Mass.:141834.40
Organism:Homo sapiens (Human)
Description:O14727
Residue:1248
BDBM48039
NameBDBM48039
Synonyms:3-[[(4E)-4-(2,4-dimethylphenyl)sulfonylimino-1-keto-2-naphthyl]amino]benzoic acid 3-[[(4E)-4-(2,4-dimethylphenyl)sulfonylimino-1-oxo-2-naphthalenyl]amino]benzoic acid MLS000948061 cid_5824726
TypeSmall organic molecule
Emp. Form.C25H20N2O5S
Mol. Mass.460.502
SMILESCc1ccc(c(C)c1)S(=O)(=O)N=C1C=C(Nc2cccc(c2)C(O)=O)C(=O)c2ccccc12