Reaction Details
TargetApoptotic protease-activating factor 1
LigandBDBM83968
Substrate/Competitorn/a
Meas. Tech.Dose Response validation of Activators of Apaf-1 using a Fluorescent Interference Counterscreen assay
EC50>100000±0 nM
Citation PubChem, PC Dose Response validation of Activators of Apaf-1 using a Fluorescent Interference Counterscreen assay PubChem Bioassay(2011)[AID]
 
Apoptotic protease-activating factor 1
Name:Apoptotic protease-activating factor 1
Type:Enzyme Catalytic Domain
Mol. Mass.:141834.40
Organism:Homo sapiens (Human)
Description:O14727
Residue:1248
BDBM83968
NameBDBM83968
Synonyms:1-[3-(brosylamino)-1,4-diketo-2-naphthyl]nipecotic acid ethyl ester MLS001076812 cid_3488168 ethyl 1-[3-[(4-bromophenyl)sulfonylamino]-1,4-dioxonaphthalen-2-yl]piperidine-3-carboxylate
TypeSmall organic molecule
Emp. Form.C24H23BrN2O6S
Mol. Mass.547.418
SMILESCCOC(=O)C1CCCN(C1)C1=C(NS(=O)(=O)c2ccc(Br)cc2)C(=O)c2ccccc2C1=O