Reaction Details
TargetMultidrug resistance protein CDR1
LigandBDBM84131
Substrate/Competitorn/a
Meas. Tech.Dose Response HTS singleplex for inhibitors of yeast efflux pump, specifically Cdr1 with Hit compounds from Cherry Pick1
EC50 18±n/a nM
Citation PubChem, PC Dose Response HTS singleplex for inhibitors of yeast efflux pump, specifically Cdr1 with Hit compounds from Cherry Pick1 PubChem Bioassay(2011)[AID]
 
Multidrug resistance protein CDR1
Name:Multidrug resistance protein CDR1
Type:PROTEIN
Mol. Mass.:169942.67
Organism:Candida albicans
Description:ChEMBL_708756
Residue:1501
BDBM84131
NameBDBM84131
Synonyms:2-benzamidoacetic acid [2-[2-methyl-5-(4-morpholinylsulfonyl)anilino]-2-oxoethyl] ester MLS000394703 [2-(2-methyl-5-morpholin-4-ylsulfonylanilino)-2-oxoethyl] 2-benzamidoacetate cid_3498913
TypeSmall organic molecule
Emp. Form.C22H25N3O7S
Mol. Mass.475.515
SMILESCc1ccc(cc1NC(=O)COC(=O)CNC(=O)c1ccccc1)S(=O)(=O)N1CCOCC1