Reaction Details
TargetMultidrug resistance protein CDR1
LigandBDBM84135
Substrate/Competitorn/a
Meas. Tech.Dose Response HTS singleplex for inhibitors of yeast efflux pump, specifically Cdr1 with Hit compounds from Cherry Pick1
EC50 11500±n/a nM
Citation PubChem, PC Dose Response HTS singleplex for inhibitors of yeast efflux pump, specifically Cdr1 with Hit compounds from Cherry Pick1 PubChem Bioassay(2011)[AID]
 
Multidrug resistance protein CDR1
Name:Multidrug resistance protein CDR1
Type:PROTEIN
Mol. Mass.:169942.67
Organism:Candida albicans
Description:ChEMBL_708756
Residue:1501
BDBM84135
NameBDBM84135
Synonyms:MLS000877353 cid_16682116
TypeSmall organic molecule
Emp. Form.C27H23ClFN3O5
Mol. Mass.523.94
SMILESCc1noc(C)c1C(=O)N1CCC2(CC1)Oc1ccc(F)cc1C(=O)C21CC(=NO1)c1ccc(Cl)cc1