Reaction Details
TargetMultidrug resistance protein CDR1
LigandBDBM51787
Substrate/Competitorn/a
Meas. Tech.Dose Response HTS singleplex for inhibitors of yeast efflux pump, specifically Cdr1 with Hit compounds from Cherry Pick1
EC50 12200±n/a nM
Citation PubChem, PC Dose Response HTS singleplex for inhibitors of yeast efflux pump, specifically Cdr1 with Hit compounds from Cherry Pick1 PubChem Bioassay(2011)[AID]
 
Multidrug resistance protein CDR1
Name:Multidrug resistance protein CDR1
Type:PROTEIN
Mol. Mass.:169942.67
Organism:Candida albicans
Description:ChEMBL_708756
Residue:1501
BDBM51787
NameBDBM51787
Synonyms:2-chloranyl-4-[5-[(1-oxidanylidene-[1,3]thiazolo[3,2-a]benzimidazol-2-ylidene)methyl]furan-2-yl]benzoic acid 2-chloro-4-[5-[(1-oxo-2-thiazolo[3,2-a]benzimidazolylidene)methyl]-2-furanyl]benzoic acid 2-chloro-4-{5-[(E)-(3-oxo[1,3]thiazolo[3,2-a]benzimidazol-2(3H)-ylidene)methyl]-2-furyl}benzoic acid SMR000556293 | cid_1232518
TypeSmall organic molecule
Emp. Form.C21H11ClN2O4S
Mol. Mass.422.841
SMILESOC(=O)c1ccc(cc1Cl)-c1ccc(C=c2sc3nc4ccccc4n3c2=O)o1