Reaction Details
TargetMultidrug resistance protein CDR1
LigandBDBM64469
Substrate/Competitorn/a
Meas. Tech.Dose Response HTS singleplex for inhibitors of yeast efflux pump, specifically Cdr1 with Hit compounds from Cherry Pick1
EC50 14700±n/a nM
Citation PubChem, PC Dose Response HTS singleplex for inhibitors of yeast efflux pump, specifically Cdr1 with Hit compounds from Cherry Pick1 PubChem Bioassay(2011)[AID]
 
Multidrug resistance protein CDR1
Name:Multidrug resistance protein CDR1
Type:PROTEIN
Mol. Mass.:169942.67
Organism:Candida albicans
Description:ChEMBL_708756
Residue:1501
BDBM64469
NameBDBM64469
Synonyms:5,7-bis(phenylmethyl)-4-(4-phenyl-1-piperazinyl)-7,8-dihydropteridin-6-one;2,2,2-trifluoroacetic acid 5,7-dibenzyl-4-(4-phenylpiperazin-1-yl)-7,8-dihydropteridin-6-one;2,2,2-trifluoroacetic acid MLS001074614 cid_24892521
TypeSmall organic molecule
Emp. Form.C30H30N6O
Mol. Mass.490.5988
SMILESO=C1C(Cc2ccccc2)Nc2ncnc(N3CCN(CC3)c3ccccc3)c2N1Cc1ccccc1