Reaction Details
TargetMultidrug resistance protein CDR1
LigandBDBM84139
Substrate/Competitorn/a
Meas. Tech.Dose Response HTS singleplex for inhibitors of yeast efflux pump, specifically Cdr1 with Hit compounds from Cherry Pick1
EC50 11±n/a nM
Citation PubChem, PC Dose Response HTS singleplex for inhibitors of yeast efflux pump, specifically Cdr1 with Hit compounds from Cherry Pick1 PubChem Bioassay(2011)[AID]
 
Multidrug resistance protein CDR1
Name:Multidrug resistance protein CDR1
Type:PROTEIN
Mol. Mass.:169942.67
Organism:Candida albicans
Description:ChEMBL_708756
Residue:1501
BDBM84139
NameBDBM84139
Synonyms:2-[[4-(2-furanylmethyl)-5-(thiophen-2-ylmethyl)-1,2,4-triazol-3-yl]thio]-N-(2-methoxy-3-dibenzofuranyl)acetamide 2-[[4-(furan-2-ylmethyl)-5-(thiophen-2-ylmethyl)-1,2,4-triazol-3-yl]sulfanyl]-N-(2-methoxydibenzofuran-3-yl)acetamide 2-{[4-(2-furylmethyl)-5-(2-thienylmethyl)-4H-1,2,4-triazol-3-yl]thio}-N-(2-methoxydibenzo[b,d]furan-3-yl)acetamide SMR000144219 | cid_2963625
TypeSmall organic molecule
Emp. Form.C27H22N4O4S2
Mol. Mass.530.618
SMILESCOc1cc2c(cc1NC(=O)CSc1nnc(Cc3cccs3)n1Cc1ccco1)oc1ccccc21