Reaction Details
TargetMultidrug efflux pump
LigandBDBM65186
Substrate/Competitorn/a
Meas. Tech.Dose Response HTS singleplex for inhibitors of yeast efflux pump, specifically Mdr1 with Hit compounds from Cherry Pick1
EC50 312±n/a nM
Citation PubChem, PC Dose Response HTS singleplex for inhibitors of yeast efflux pump, specifically Mdr1 with Hit compounds from Cherry Pick1 PubChem Bioassay(2011)[AID]
 
Multidrug efflux pump
Name:Multidrug efflux pump
Synonyms:Candida albicans strain ATCC 10261 multidrug efflux pump (MDR1) gene, MDR1-A allele, complete cds
Type:Enzyme Catalytic Domain
Mol. Mass.:62915.82
Organism:Candida albicans
Description:Q09GR2
Residue:564
BDBM65186
NameBDBM65186
TypeSmall organic molecule
Emp. Form.C17H34N
Mol. Mass.252.458
SMILESCCCCCCCCCCCC[N+](C)(C)CC#C