Reaction Details
TargetMultidrug efflux pump
LigandBDBM84143
Substrate/Competitorn/a
Meas. Tech.Dose Response HTS singleplex for inhibitors of yeast efflux pump, specifically Mdr1 with Hit compounds from Cherry Pick1
EC50 9580±n/a nM
Citation PubChem, PC Dose Response HTS singleplex for inhibitors of yeast efflux pump, specifically Mdr1 with Hit compounds from Cherry Pick1 PubChem Bioassay(2011)[AID]
 
Multidrug efflux pump
Name:Multidrug efflux pump
Synonyms:Candida albicans strain ATCC 10261 multidrug efflux pump (MDR1) gene, MDR1-A allele, complete cds
Type:Enzyme Catalytic Domain
Mol. Mass.:62915.82
Organism:Candida albicans
Description:Q09GR2
Residue:564
BDBM84143
NameBDBM84143
TypeSmall organic molecule
Emp. Form.C24H24N2O4S
Mol. Mass.436.523
SMILESCOc1cccc(C2CC(=NN2S(=O)(=O)c2ccc(C)cc2)c2ccccc2)c1OC