Reaction Details
TargetMultidrug efflux pump
LigandBDBM60889
Substrate/Competitorn/a
Meas. Tech.Dose Response HTS singleplex for inhibitors of yeast efflux pump, specifically Mdr1 with Hit compounds from Cherry Pick1
EC50 2720±n/a nM
Citation PubChem, PC Dose Response HTS singleplex for inhibitors of yeast efflux pump, specifically Mdr1 with Hit compounds from Cherry Pick1 PubChem Bioassay(2011)[AID]
 
Multidrug efflux pump
Name:Multidrug efflux pump
Synonyms:Candida albicans strain ATCC 10261 multidrug efflux pump (MDR1) gene, MDR1-A allele, complete cds
Type:Enzyme Catalytic Domain
Mol. Mass.:62915.82
Organism:Candida albicans
Description:Q09GR2
Residue:564
BDBM60889
NameBDBM60889
TypeSmall organic molecule
Emp. Form.C18H13NO5S2
Mol. Mass.387.43
SMILESOC(=O)C(N1C(=S)S\C(=C\c2ccc(O)c(O)c2)C1=O)c1ccccc1