Reaction Details
TargetToll-like receptor 8
LigandBDBM273251
Substrate/Competitorn/a
Meas. Tech.TLR7/8/9 Inhibition Reporter Assay
Temperature298.15±n/a K
IC50 3.00±n/a nM
Commentsextracted
Citation Dyckman, AJDodd, DSMacor, JEMussari, CPPasunoori, LKumar, SRSherwood, TCSistla, RK [1,2,4]triazolo[1,5-a]pyridinyl substituted indole compounds US Patent US10071079 Publication Date 9/11/2018
 
Toll-like receptor 8
Name:Toll-like receptor 8
Type:Enzyme
Mol. Mass.:119828.77
Organism:Homo sapiens (Human)
Description:Q9NR97
Residue:1041
BDBM273251
NameBDBM273251
Synonyms:2-(4-(3-isopropyl-2-(8-methoxy-[1,2,4]triazolo[1,5-a]pyridin-6-yl)-1H-indol-5-yl)piperidin-1-yl)-N,N-dimethylacetamide US10478424, Example 25
TypeSmall organic molecule
Emp. Form.C27H34N6O2
Mol. Mass.474.5979
SMILESCOc1cc(cn2ncnc12)-c1[nH]c2ccc(cc2c1C(C)C)C1CCN(CC(=O)N(C)C)CC1