Reaction Details
TargetToll-like receptor 8
LigandBDBM273316
Substrate/Competitorn/a
Meas. Tech.TLR7/8/9 Inhibition Reporter Assay
Temperature298.15±n/a K
IC50 3.40±n/a nM
Commentsextracted
Citation Dyckman, AJDodd, DSMacor, JEMussari, CPPasunoori, LKumar, SRSherwood, TCSistla, RK [1,2,4]triazolo[1,5-a]pyridinyl substituted indole compounds US Patent US10071079 Publication Date 9/11/2018
 
Toll-like receptor 8
Name:Toll-like receptor 8
Type:Enzyme
Mol. Mass.:119828.77
Organism:Homo sapiens (Human)
Description:Q9NR97
Residue:1041
BDBM273316
NameBDBM273316
Synonyms:US10071079, Example 90 | US10478424, Example 90
TypeSmall organic molecule
Emp. Form.C29H36N6O
Mol. Mass.484.6357
SMILESCC(C)c1c([nH]c2ccc(cc12)C1CCN(CC(=O)N2CCCC2)CC1)-c1cc(C)c2ncnn2c1