Reaction Details
TargetToll-like receptor 7
LigandBDBM273349
Substrate/Competitorn/a
Meas. Tech.TLR7/8/9 Inhibition Reporter Assay
Temperature298.15±n/a K
IC50 0.400±n/a nM
Commentsextracted
Citation Dyckman, AJDodd, DSMacor, JEMussari, CPPasunoori, LKumar, SRSherwood, TCSistla, RK [1,2,4]triazolo[1,5-a]pyridinyl substituted indole compounds US Patent US10071079 Publication Date 9/11/2018
 
Toll-like receptor 7
Name:Toll-like receptor 7
Type:Enzyme
Mol. Mass.:120945.35
Organism:Homo sapiens (Human)
Description:Q9NYK1
Residue:1049
BDBM273349
NameBDBM273349
Synonyms:US10071079, Example 128 | US10478424, Example 128
TypeSmall organic molecule
Emp. Form.C23H24F3N5
Mol. Mass.427.4654
SMILESCC(C)c1c([nH]c2ccc(cc12)C1CCNCC1)-c1cc(c2ncnn2c1)C(F)(F)F