Reaction Details
TargetToll-like receptor 7
LigandBDBM273356
Substrate/Competitorn/a
Meas. Tech.TLR7/8/9 Inhibition Reporter Assay
Temperature298.15±n/a K
IC50 0.300±n/a nM
Commentsextracted
Citation Dyckman, AJDodd, DSMacor, JEMussari, CPPasunoori, LKumar, SRSherwood, TCSistla, RK [1,2,4]triazolo[1,5-a]pyridinyl substituted indole compounds US Patent US10071079 Publication Date 9/11/2018
 
Toll-like receptor 7
Name:Toll-like receptor 7
Type:Enzyme
Mol. Mass.:120945.35
Organism:Homo sapiens (Human)
Description:Q9NYK1
Residue:1049
BDBM273356
NameBDBM273356
Synonyms:US10071079, Example 138 | US10478424, Example 138
TypeSmall organic molecule
Emp. Form.C24H28ClN5
Mol. Mass.421.966
SMILESCC(C)c1c([nH]c2ccc(cc12)C1CCNCC1)-c1cn2nc(C)nc2c(Cl)c1C