Reaction Details
TargetToll-like receptor 9
LigandBDBM273769
Substrate/Competitorn/a
Meas. Tech.TLR7/8/9 Inhibition Reporter Assay
Temperature298.15±n/a K
IC50 2160±n/a nM
Commentsextracted
Citation Dyckman, AJDodd, DSMacor, JEMussari, CPPasunoori, LKumar, SRSherwood, TCSistla, RK [1,2,4]triazolo[1,5-a]pyridinyl substituted indole compounds US Patent US10071079 Publication Date 9/11/2018
 
Toll-like receptor 9
Name:Toll-like receptor 9
Type:Enzyme
Mol. Mass.:115889.91
Organism:Homo sapiens (Human)
Description:Q9NR96
Residue:1032
BDBM273769
NameBDBM273769
Synonyms:US10071079, Example 555 | US10478424, Example 555
TypeSmall organic molecule
Emp. Form.C28H32F3N5O
Mol. Mass.511.5818
SMILESCC(C)c1c([nH]c2ccc(cc12)C1CCN(CC2(C)COC2)CC1)-c1cc(c2ncnn2c1)C(F)(F)F