Reaction Details
TargetToll-like receptor 7
LigandBDBM273952
Substrate/Competitorn/a
Meas. Tech.TLR7/8/9 Inhibition Reporter Assay
Temperature298.15±n/a K
IC50 0.400±n/a nM
Commentsextracted
Citation Dyckman, AJDodd, DSMacor, JEMussari, CPPasunoori, LKumar, SRSherwood, TCSistla, RK [1,2,4]triazolo[1,5-a]pyridinyl substituted indole compounds US Patent US10071079 Publication Date 9/11/2018
 
Toll-like receptor 7
Name:Toll-like receptor 7
Type:Enzyme
Mol. Mass.:120945.35
Organism:Homo sapiens (Human)
Description:Q9NYK1
Residue:1049
BDBM273952
NameBDBM273952
Synonyms:US10071079, Example 738 | US10478424, Example 738
TypeSmall organic molecule
Emp. Form.C30H37FN6O
Mol. Mass.516.6528
SMILESCC(C)c1c([nH]c2ccc(cc12)C1CCN(CC1)C(=O)CN1CC[C@H](F)C1)-c1cn2ncnc2c(C)c1C