Reaction Details
TargetcAMP-dependent protein kinase catalytic subunit alpha/beta/gamma
LigandBDBM3162
Substrate/Competitorn/a
Meas. Tech.PKC assay
IC50 26000±n/a nM
Citation Mendoza, JSJagdmann , GEGosnell, PA SYNTHESIS AND BIOLOGICAL EVALUATION OF CONFORMATIONALLY CONSTRAINED BICYCLIC AND TRICYCLIC BALANOL ANALOGUES AS INHIBITORS OF PROTEIN KINASE C. Bioorg Med Chem Lett5:2211-6 (1995)    Article
 
cAMP-dependent protein kinase catalytic subunit alpha/beta/gamma
Name:cAMP-dependent protein kinase catalytic subunit alpha/beta/gamma
Synonyms:cAMP-dependent protein kinase (PKA)
Type:n/a
Mol. Mass.:n/a
Description:ASSAY_ID of ChEMBL is 217489
Components:This complex has 3 components.
Component 1
Name:cAMP-dependent protein kinase catalytic subunit beta
Type:PROTEIN
Mol. Mass.:40631.25
Organism:Homo sapiens (Human)
Description:ChEMBL_586348
Residue:351
Component 2
Name:cAMP-dependent protein kinase catalytic subunit alpha
Synonyms:KAPCA_HUMAN PKACA cAMP-dependent protein kinase (PKA) cAMP-dependent protein kinase catalytic subunit alpha cAMP-dependent protein kinase catalytic subunit alpha (PKACA) cAMP-dependent protein kinase catalytic subunit alpha isoform 1 | cAMP-dependent protein kinase, alpha-catalytic subunit
Type:Enzyme Catalytic Subunit
Mol. Mass.:40598.73
Organism:Homo sapiens (Human)
Description:n/a
Residue:351
Component 3
Name:cAMP-dependent protein kinase catalytic subunit gamma
Synonyms:KAPCG_HUMAN PRKACG cAMP-dependent protein kinase catalytic subunit gamma
Type:PROTEIN
Mol. Mass.:40442.03
Organism:Homo sapiens (Human)
Description:ChEMBL_104720
Residue:351
BDBM3162
NameBDBM3162
Synonyms:2-({2,6-dihydroxy-4-[({3-[(4-hydroxybenzene)amido]-1,7,7-trimethylbicyclo[2.2.1]heptan-2-yl}oxy)carbonyl]phenyl}carbonyl)-3-hydroxybenzoic acid | Balanol analog 28
TypeSmall organic molecule
Emp. Form.C32H31NO10
Mol. Mass.589.5892
SMILESCC1(C)C2CCC1(C)C(OC(=O)c1cc(O)c(C(=O)c3c(O)cccc3C(O)=O)c(O)c1)C2NC(=O)c1ccc(O)cc1