Reaction Details
TargetThymidylate synthase
LigandBDBM36699
Substrate/Competitorn/a
Meas. Tech.Inhibition Assay
Ki>1.804e+6±n/a nM
Citation Calò, STondi, DFerrari, SVenturelli, AGhelli, SCosti, MP Constrained dansyl derivatives reveal bacterial specificity of highly conserved thymidylate synthases. Chembiochem9:779-90 (2008) 
 
Thymidylate synthase
Name:Thymidylate synthase
Type:Enzyme
Mol. Mass.:30475.81
Organism:Escherichia coli
Description:n/a
Residue:264
BDBM36699
NameBDBM36699
Synonyms:Dansyl derivative, 8L | Dansyltyrosine deriviative 16B
TypeSmall organic molecule
Emp. Form.C28H28N2O7S2
Mol. Mass.568.661
SMILESCN(C)c1cccc2c(cccc12)S(=O)(=O)Oc1ccc(C[C@H](NS(=O)(=O)Cc2ccccc2)C(O)=O)cc1