Reaction Details
TargetSomatostatin receptor type 3
LigandBDBM82465
Substrate/Competitorn/a
Ki 8.2±n/a nM
CommentsPDSP_374
Citation Patel, YCSrikant, CB Subtype selectivity of peptide analogs for all five cloned human somatostatin receptors (hsstr 1-5). Endocrinology135:2814-7 (1994) 
 
Somatostatin receptor type 3
Name:Somatostatin receptor type 3
Type:Protein
Mol. Mass.:45855.97
Organism:Homo sapiens (Human)
Description:P32745
Residue:418
BDBM82465
NameBDBM82465
Synonyms:BIM 23023 D-Phe-L-Cys(1)-L-Tyr-D-Trp-L-Lys-L-Abu-L-Cys(1)-L-Thr-NH2
TypeSmall organic molecule
Emp. Form.C49H65N11O10S2
Mol. Mass.1032.238
SMILESCC[C@@H]1NC(=O)[C@H](CCCCN)NC(=O)[C@@H](Cc2c[nH]c3ccccc23)NC(=O)[C@H](Cc2ccc(O)cc2)NC(=O)[C@H](CSSC[C@H](NC1=O)C(=O)N[C@@H]([C@@H](C)O)C(N)=O)NC(=O)[C@H](N)Cc1ccccc1