Reaction Details
TargetSomatostatin receptor type 3
LigandBDBM81767
Substrate/Competitorn/a
Ki 1.6±n/a nM
CommentsPDSP_1735
Citation Patel, YCSrikant, CB Subtype selectivity of peptide analogs for all five cloned human somatostatin receptors (hsstr 1-5). Endocrinology135:2814-7 (1994) 
 
Somatostatin receptor type 3
Name:Somatostatin receptor type 3
Type:Protein
Mol. Mass.:45855.97
Organism:Homo sapiens (Human)
Description:P32745
Residue:418
BDBM81767
NameBDBM81767
Synonyms:15-28-Somatostatin-28 CB6417646 | Somatostatin-14
TypeSmall organic molecule
Emp. Form.C76H104N18O19S2
Mol. Mass.1637.878
SMILESC[C@@H](O)[C@@H]1NC(=O)[C@H](Cc2ccccc2)NC(=O)[C@@H](NC(=O)[C@H](CCCCN)NC(=O)[C@H](Cc2c[nH]c3ccccc23)NC(=O)[C@H](Cc2ccccc2)NC(=O)[C@H](Cc2ccccc2)NC(=O)[C@H](CC(N)=O)NC(=O)[C@H](CCCCN)NC(=O)[C@H](CSSC[C@H](NC(=O)[C@H](CO)NC1=O)C(O)=O)NC(=O)CNC(=O)[C@H](C)N)[C@@H](C)O