Reaction Details
TargetSomatostatin receptor type 4
LigandBDBM84630
Substrate/Competitorn/a
Ki 56±n/a nM
CommentsPDSP_389
Citation Patel, YCSrikant, CB Subtype selectivity of peptide analogs for all five cloned human somatostatin receptors (hsstr 1-5). Endocrinology135:2814-7 (1994) 
 
Somatostatin receptor type 4
Name:Somatostatin receptor type 4
Type:Enzyme
Mol. Mass.:42015.38
Organism:Homo sapiens (Human)
Description:P31391
Residue:388
BDBM84630
NameBDBM84630
Synonyms:BIM 23060
TypeSmall organic molecule
Emp. Form.C56H66N10O9S2
Mol. Mass.1087.315
SMILESCC(O)C1NC(=O)C(CCCCN)NC(=O)C(Cc2c[nH]c3ccccc23)NC(=O)C(Cc2ccc(O)cc2)NC(=O)C(CSSCC(NC1=O)C(=O)NCc1cccc2ccccc12)NC(=O)C(N)Cc1ccccc1