Reaction Details
TargetSomatostatin receptor type 1
LigandBDBM84624
Substrate/Competitorn/a
Ki 1000±n/a nM
CommentsPDSP_395
Citation Raynor, KMurphy, WACoy, DHTaylor, JEMoreau, JPYasuda, KBell, GIReisine, T Cloned somatostatin receptors: identification of subtype-selective peptides and demonstration of high affinity binding of linear peptides. Mol Pharmacol43:838-44 (1993) Somatostatin receptor type 1
Name:Somatostatin receptor type 1
Type:Enzyme
Mol. Mass.:42692.81
Organism:Homo sapiens (Human)
Description:P30872
Residue:391
BDBM84624
NameBDBM84624
Synonyms:BIM 23068
TypeSmall organic molecule
Emp. Form.C61H74ClN11O11
Mol. Mass.1172.76
SMILESC[C@@H](O)[C@H](NC(=O)[C@H](Cc1ccccc1)NC(=O)[C@@H](NC(=O)[C@H](CCCCN)NC(=O)[C@@H](Cc1c[nH]c2ccccc12)NC(=O)[C@H](Cc1ccc(O)cc1)NC(=O)[C@H](Cc1ccc(Cl)cc1)NC(=O)[C@H](N)Cc1ccccc1)C(C)O)C(N)=O